Reaction Details
TargetMu-type opioid receptor
LigandBDBM50278436
Substrate/Competitorn/a
Meas. Tech.ChEMBL_565185 (CHEMBL958391)
Ki 0.510000±n/a nM
Citation Wentland, MPLou, RLu, QBu, YDenhardt, CJin, JGanorkar, RVanAlstine, MAGuo, CCohen, DJBidlack, JM Syntheses of novel high affinity ligands for opioid receptors. Bioorg Med Chem Lett19:2289-94 (2009) 
 
Mu-type opioid receptor
Name:Mu-type opioid receptor
Type:G Protein-Coupled Receptor (GPCR)
Mol. Mass.:44789.51
Organism:Homo sapiens (Human)
Description:P35372
Residue:400
BDBM50278436
NameBDBM50278436
Synonyms:(1R,13S,14R)-24-(cyclopropylmethyl)-13,20-dihydroxy-4,24-diazahexacyclo[12.7.3.0^{1,13}.0^{3,11}.0^{5,10}.0^{16,21}]tetracosa-3(11),5(10),6,8,16(21),17,19-heptaene-19-carboxamide | CHEMBL469815
TypeSmall organic molecule
Emp. Form.C27H29N3O3
Mol. Mass.443.5375
SMILESNC(=O)c1ccc2C[C@H]3N(CC4CC4)CC[C@@]4(Cc5[nH]c6ccccc6c5C[C@@]34O)c2c1O