Reaction Details
TargetSialidase
LigandBDBM7458
Substrate/Competitorn/a
Meas. Tech.ChEMBL_565685 (CHEMBL960043)
IC50 17400±n/a nM
Citation Ryu, YBCurtis-Long, MJLee, JWKim, JHKim, JYKang, KYLee, WSPark, KH Characteristic of neuraminidase inhibitory xanthones from Cudrania tricuspidata. Bioorg Med Chem17:2744-50 (2009) 
 
Sialidase
Name:Sialidase
Type:PROTEIN
Mol. Mass.:42808.79
Organism:Clostridium perfringens
Description:ChEMBL_991336
Residue:382
BDBM7458
NameBDBM7458
Synonyms:5,7-dihydroxy-2-(4-hydroxyphenyl)-4H-chromen-4-one Apigenin Apigenin (3) Apigenin, 13 Naringenin, 18 US11337935, Compound Apigenin cid_5280443 | jm5b01461, Compound 90
TypeSmall organic molecule
Emp. Form.C15H10O5
Mol. Mass.270.2369
SMILESOc1ccc(cc1)-c1cc(=O)c2c(O)cc(O)cc2o1