Reaction Details
TargetCarbonic anhydrase 12
LigandBDBM50278847
Substrate/Competitorn/a
Meas. Tech.ChEMBL_501260 (CHEMBL976162)
Ki 10±n/a nM
Citation Singer, MLopez, MBornaghi, LFInnocenti, AVullo, DSupuran, CTPoulsen, SA Inhibition of carbonic anhydrase isozymes with benzene sulfonamides incorporating thio, sulfinyl and sulfonyl glycoside moieties. Bioorg Med Chem Lett19:2273-6 (2009) 
 
Carbonic anhydrase 12
Name:Carbonic anhydrase 12
Type:Enzyme
Mol. Mass.:39456.00
Organism:Homo sapiens (Human)
Description:Catalytic domain of human cloned isozyme was used in the assay
Residue:354
BDBM50278847
NameBDBM50278847
Synonyms:4-(4-{[beta-D-galactopyranosyl]thiomethyl}-1-H-1,2,3-triazol-1-yl)benzenesulfonamide | CHEMBL498758
TypeSmall organic molecule
Emp. Form.C15H20N4O7S2
Mol. Mass.432.472
SMILESNS(=O)(=O)c1ccc(cc1)-n1cc(CS[C@@H]2O[C@H](CO)[C@H](O)[C@H](O)[C@H]2O)nn1