Reaction Details
TargetCarbonic anhydrase 2
LigandBDBM15223
Substrate/Competitorn/a
Meas. Tech.ChEMBL_501258 (CHEMBL976160)
Ki 46±n/a nM
Citation Singer, MLopez, MBornaghi, LFInnocenti, AVullo, DSupuran, CTPoulsen, SA Inhibition of carbonic anhydrase isozymes with benzene sulfonamides incorporating thio, sulfinyl and sulfonyl glycoside moieties. Bioorg Med Chem Lett19:2273-6 (2009) 
 
Carbonic anhydrase 2
Name:Carbonic anhydrase 2
Type:Enzyme
Mol. Mass.:29250.71
Organism:Homo sapiens (Human)
Description:P00918
Residue:260
BDBM15223
NameBDBM15223
Synonyms:4-(4-{[(2,3,4,6-tetra-O-acetyl-beta-D-glucopyranosyl)oxy]methyl}-1H-1,2,3-triazol-1-yl)benzenesulfonamide [(2R,3R,4S,5R,6R)-3,4,5-tris(acetyloxy)-6-{[1-(4-sulfamoylphenyl)-1H-1,2,3-triazol-4-yl]methoxy}oxan-2-yl]methyl acetate | glycoconjugate sulfonamide 7
TypeSmall organic molecule
Emp. Form.C23H28N4O12S
Mol. Mass.584.553
SMILESCC(=O)OC[C@H]1O[C@@H](OCc2cn(nn2)-c2ccc(cc2)S(N)(=O)=O)[C@H](OC(C)=O)[C@@H](OC(C)=O)[C@@H]1OC(C)=O