Reaction Details
TargetCarbonic anhydrase 9
LigandBDBM50278151
Substrate/Competitorn/a
Meas. Tech.ChEMBL_501259 (CHEMBL976161)
Ki 101±n/a nM
Citation Singer, MLopez, MBornaghi, LFInnocenti, AVullo, DSupuran, CTPoulsen, SA Inhibition of carbonic anhydrase isozymes with benzene sulfonamides incorporating thio, sulfinyl and sulfonyl glycoside moieties. Bioorg Med Chem Lett19:2273-6 (2009) 
 
Carbonic anhydrase 9
Name:Carbonic anhydrase 9
Type:Enzyme
Mol. Mass.:49669.03
Organism:Homo sapiens (Human)
Description:Catalytic domain of human cloned isozyme was used in the assay
Residue:459
BDBM50278151
NameBDBM50278151
Synonyms:(2R,3R,4R,5R,6R)-4,5-dihydroxy-2-(hydroxymethyl)-6-((1-(4-sulfamoylphenyl)-1H-1,2,3-triazol-4-yl)methoxy)tetrahydro-2H-pyran-3-yl acetate | CHEMBL472077
TypeSmall organic molecule
Emp. Form.C17H22N4O9S
Mol. Mass.458.443
SMILESCC(=O)O[C@H]1[C@@H](CO)O[C@@H](OCc2cn(nn2)-c2ccc(cc2)S(N)(=O)=O)[C@H](O)[C@H]1O