Reaction Details
TargetCarbonic anhydrase 9
LigandBDBM15222
Substrate/Competitorn/a
Meas. Tech.ChEMBL_501259 (CHEMBL976161)
Ki 105±n/a nM
Citation Singer, MLopez, MBornaghi, LFInnocenti, AVullo, DSupuran, CTPoulsen, SA Inhibition of carbonic anhydrase isozymes with benzene sulfonamides incorporating thio, sulfinyl and sulfonyl glycoside moieties. Bioorg Med Chem Lett19:2273-6 (2009) 
 
Carbonic anhydrase 9
Name:Carbonic anhydrase 9
Type:Enzyme
Mol. Mass.:49669.03
Organism:Homo sapiens (Human)
Description:Catalytic domain of human cloned isozyme was used in the assay
Residue:459
BDBM15222
NameBDBM15222
Synonyms:4-Azidobenzenesulfonamide CHEMBL222837 | azide 1
TypeSmall organic molecule
Emp. Form.C6H6N4O2S
Mol. Mass.198.202
SMILESNS(=O)(=O)c1ccc(cc1)N=[N+]=[N-]