Reaction Details
TargetHydroxycarboxylic acid receptor 2
LigandBDBM50277712
Substrate/Competitorn/a
Meas. Tech.ChEMBL_501319 (CHEMBL971505)
IC50 4200±n/a nM
Citation Imbriglio, JEChang, SLiang, RRaghavan, SSchmidt, DSmenton, ATria, SSchrader, TOJung, JKEsser, CTaggart, AKCheng, KCarballo-Jane, EGerard Waters, MTata, JRColletti, SL GPR109a agonists. Part 1: 5-Alkyl and 5-aryl-pyrazole-tetrazoles as agonists of the human orphan G-protein coupled receptor GPR109a. Bioorg Med Chem Lett19:2121-4 (2009) 
 
Hydroxycarboxylic acid receptor 2
Name:Hydroxycarboxylic acid receptor 2
Type:PROTEIN
Mol. Mass.:41418.01
Organism:Mus musculus
Description:ChEMBL_820676
Residue:360
BDBM50277712
NameBDBM50277712
Synonyms:3-(1H-tetrazol-5-yl)-5-o-tolyl-1,4,5,6-tetrahydrocyclopenta[c]pyrazole | CHEMBL485194
TypeSmall organic molecule
Emp. Form.C14H14N6
Mol. Mass.266.3012
SMILESCc1ccccc1C1Cc2[nH]nc(c2C1)-c1nnn[nH]1