Reaction Details
TargetAurora kinase B
LigandBDBM12986
Substrate/Competitorn/a
Meas. Tech.ChEMBL_501649 (CHEMBL993739)
IC50 1210±n/a nM
Citation Pollard, JRMortimore, M Discovery and development of aurora kinase inhibitors as anticancer agents. J Med Chem52:2629-51 (2009) 
 
Aurora kinase B
Name:Aurora kinase B
Type:Protein
Mol. Mass.:39327.72
Organism:Homo sapiens (Human)
Description:Q96GD4
Residue:344
BDBM12986
NameBDBM12986
Synonyms:4-(4-methylpiperazin-1-yl)-N-{5-[(2S)-2-phenylpropanoyl]-1H,4H,5H,6H-pyrrolo[3,4-c]pyrazol-3-yl}benzamide CHEMBL217748
TypeSmall organic molecule
Emp. Form.C26H30N6O2
Mol. Mass.458.5554
SMILESC[C@H](C(=O)N1Cc2n[nH]c(NC(=O)c3ccc(cc3)N3CCN(C)CC3)c2C1)c1ccccc1