Reaction Details
TargetAurora kinase B
LigandBDBM50277832
Substrate/Competitorn/a
Meas. Tech.ChEMBL_501649 (CHEMBL993739)
IC50 42±n/a nM
Citation Pollard, JRMortimore, M Discovery and development of aurora kinase inhibitors as anticancer agents. J Med Chem52:2629-51 (2009) 
 
Aurora kinase B
Name:Aurora kinase B
Type:Protein
Mol. Mass.:39327.72
Organism:Homo sapiens (Human)
Description:Q96GD4
Residue:344
BDBM50277832
NameBDBM50277832
Synonyms:2-(6-methoxy-7-(3-morpholinopropoxy)quinazolin-4-ylamino)-N-phenylthiazole-5-carboxamide | CHEMBL482774
TypeSmall organic molecule
Emp. Form.C26H28N6O4S
Mol. Mass.520.603
SMILESCOc1cc2c(Nc3ncc(s3)C(=O)Nc3ccccc3)ncnc2cc1OCCCN1CCOCC1