Reaction Details
TargetHigh affinity nerve growth factor receptor
LigandBDBM13534
Substrate/Competitorn/a
Meas. Tech.ChEMBL_501665 (CHEMBL981413)
Kd 38±n/a nM
Citation Pollard, JRMortimore, M Discovery and development of aurora kinase inhibitors as anticancer agents. J Med Chem52:2629-51 (2009) 
 
High affinity nerve growth factor receptor
Name:High affinity nerve growth factor receptor
Type:n/a
Mol. Mass.:87498.18
Organism:Homo sapiens (Human)
Description:P04629
Residue:796
BDBM13534
NameBDBM13534
Synonyms:CHEMBL572878 N-[4-[[4-(4-methylpiperazino)-6-[(5-methyl-1H-pyrazol-3-yl)amino]pyrimidin-2-yl]thio]phenyl]cyclopropanecarboxamide VX680 | cyclopropane carboxylic acid {4-[4-(4-methyl-piperazin-1-yl)-6-(5-methyl-2H-pyrazol-3-ylamino)-pyrimidin-2ylsulphanyl]-phenyl}-amide
TypeSmall organic molecule
Emp. Form.C23H28N8OS
Mol. Mass.464.586
SMILESCN1CCN(CC1)c1cc(Nc2cc(C)n[nH]2)nc(Sc2ccc(NC(=O)C3CC3)cc2)n1