Reaction Details
TargetGlycogen synthase kinase-3 beta
LigandBDBM50277585
Substrate/Competitorn/a
Meas. Tech.ChEMBL_501673 (CHEMBL981421)
Ki 1034±n/a nM
Citation Pollard, JRMortimore, M Discovery and development of aurora kinase inhibitors as anticancer agents. J Med Chem52:2629-51 (2009) 
 
Glycogen synthase kinase-3 beta
Name:Glycogen synthase kinase-3 beta
Type:Enzyme
Mol. Mass.:46756.38
Organism:Homo sapiens (Human)
Description:P49841
Residue:420
BDBM50277585
NameBDBM50277585
Synonyms:CHEMBL484950 N-(4-(4-(5-methyl-1H-pyrazol-3-ylamino)quinazolin-2-ylthio)phenyl)acetamide
TypeSmall organic molecule
Emp. Form.C20H18N6OS
Mol. Mass.390.462
SMILESCC(=O)Nc1ccc(Sc2nc(Nc3cc(C)n[nH]3)c3ccccc3n2)cc1