Reaction Details
TargetVascular endothelial growth factor receptor 2
LigandBDBM50277584
Substrate/Competitorn/a
Meas. Tech.ChEMBL_501694 (CHEMBL981442)
IC50 36±n/a nM
Citation Pollard, JRMortimore, M Discovery and development of aurora kinase inhibitors as anticancer agents. J Med Chem52:2629-51 (2009) 
 
Vascular endothelial growth factor receptor 2
Name:Vascular endothelial growth factor receptor 2
Type:Receptor Tyrosine Kinase
Mol. Mass.:151510.97
Organism:Homo sapiens (Human)
Description:P35968
Residue:1356
BDBM50277584
NameBDBM50277584
Synonyms:CHEMBL482968 | N-(5-methyl-1H-pyrazol-3-yl)-6-(4-methylpiperazin-1-yl)-2-styrylpyrimidin-4-amine
TypeSmall organic molecule
Emp. Form.C21H25N7
Mol. Mass.375.4701
SMILESCN1CCN(CC1)c1cc(Nc2cc(C)n[nH]2)nc(C=Cc2ccccc2)n1