Reaction Details
TargetAurora kinase A
LigandBDBM12984
Substrate/Competitorn/a
Meas. Tech.ChEMBL_501648 (CHEMBL993738)
IC50 24±n/a nM
Citation Pollard, JRMortimore, M Discovery and development of aurora kinase inhibitors as anticancer agents. J Med Chem52:2629-51 (2009) 
 
Aurora kinase A
Name:Aurora kinase A
Type:Serine/threonine-protein kinase
Mol. Mass.:45830.98
Organism:Homo sapiens (Human)
Description:O14965
Residue:403
BDBM12984
NameBDBM12984
Synonyms:4-(4-methylpiperazin-1-yl)-N-{5-[(2R)-2-phenylpropanoyl]-1H,4H,5H,6H-pyrrolo[3,4-c]pyrazol-3-yl}benzamide CHEMBL427787
TypeSmall organic molecule
Emp. Form.C26H30N6O2
Mol. Mass.458.5554
SMILESC[C@@H](C(=O)N1Cc2n[nH]c(NC(=O)c3ccc(cc3)N3CCN(C)CC3)c2C1)c1ccccc1