Reaction Details
TargetAurora kinase A
LigandBDBM26311
Substrate/Competitorn/a
Meas. Tech.ChEMBL_501648 (CHEMBL993738)
IC50 1200±n/a nM
Citation Pollard, JRMortimore, M Discovery and development of aurora kinase inhibitors as anticancer agents. J Med Chem52:2629-51 (2009) 
 
Aurora kinase A
Name:Aurora kinase A
Type:Serine/threonine-protein kinase
Mol. Mass.:45830.98
Organism:Homo sapiens (Human)
Description:O14965
Residue:403
BDBM26311
NameBDBM26311
Synonyms:3-[4-(2-{thieno[3,2-d]pyrimidin-4-ylamino}ethyl)phenyl]-1-[3-(trifluoromethyl)phenyl]urea thieno[3,2-d]pyrimidine analogue, 6
TypeSmall organic molecule
Emp. Form.C22H18F3N5OS
Mol. Mass.457.471
SMILESFC(F)(F)c1cccc(NC(=O)Nc2ccc(CCNc3ncnc4ccsc34)cc2)c1