Reaction Details
TargetAurora kinase A
LigandBDBM26297
Substrate/Competitorn/a
Meas. Tech.ChEMBL_501648 (CHEMBL993738)
IC50 800±n/a nM
Citation Pollard, JRMortimore, M Discovery and development of aurora kinase inhibitors as anticancer agents. J Med Chem52:2629-51 (2009) 
 
Aurora kinase A
Name:Aurora kinase A
Type:Serine/threonine-protein kinase
Mol. Mass.:45830.98
Organism:Homo sapiens (Human)
Description:O14965
Residue:403
BDBM26297
NameBDBM26297
Synonyms:CHEMBL215322 pyrazoloquinazoline deriv., 31
TypeSmall organic molecule
Emp. Form.C26H29F2N7O3
Mol. Mass.525.5504
SMILESCCN(CCO)CCCOc1ccc2c(Nc3cc(CC(=O)Nc4cccc(F)c4F)n[nH]3)ncnc2c1