Reaction Details
TargetCarbonic anhydrase 12
LigandBDBM11028
Substrate/Competitorn/a
Meas. Tech.ChEMBL_544669 (CHEMBL1009246)
Ki 0.32±n/a nM
Citation Thiry, ARolin, SVullo, DFrankart, AScozzafava, ADogné, JMWouters, JSupuran, CTMasereel, B Indanesulfonamides as carbonic anhydrase inhibitors and anticonvulsant agents: structure-activity relationship and pharmacological evaluation. Eur J Med Chem43:2853-60 (2008) 
 
Carbonic anhydrase 12
Name:Carbonic anhydrase 12
Type:Enzyme
Mol. Mass.:39456.00
Organism:Homo sapiens (Human)
Description:Catalytic domain of human cloned isozyme was used in the assay
Residue:354
BDBM11028
NameBDBM11028
Synonyms:1-Acetamido-5-sulfonamidoindane Indanesulfonamide Derivative 5 | N-(5-sulfamoyl-2,3-dihydro-1H-inden-1-yl)acetamide
TypeSmall organic molecule
Emp. Form.C11H14N2O3S
Mol. Mass.254.305
SMILESCC(=O)NC1CCc2cc(ccc12)S(N)(=O)=O