Reaction Details
TargetCarbonic anhydrase 12
LigandBDBM11033
Substrate/Competitorn/a
Meas. Tech.ChEMBL_544669 (CHEMBL1009246)
Ki 9.1±n/a nM
Citation Thiry, ARolin, SVullo, DFrankart, AScozzafava, ADogné, JMWouters, JSupuran, CTMasereel, B Indanesulfonamides as carbonic anhydrase inhibitors and anticonvulsant agents: structure-activity relationship and pharmacological evaluation. Eur J Med Chem43:2853-60 (2008) 
 
Carbonic anhydrase 12
Name:Carbonic anhydrase 12
Type:Enzyme
Mol. Mass.:39456.00
Organism:Homo sapiens (Human)
Description:Catalytic domain of human cloned isozyme was used in the assay
Residue:354
BDBM11033
NameBDBM11033
Synonyms:2-cyclohexylamido-5-sulfonamidoindane Indanesulfonamide Derivative 12b | N-(5-sulfamoyl-2,3-dihydro-1H-inden-2-yl)cyclohexanecarboxamide
TypeSmall organic molecule
Emp. Form.C16H22N2O3S
Mol. Mass.322.422
SMILESNS(=O)(=O)c1ccc2CC(Cc2c1)NC(=O)C1CCCCC1