Reaction Details
TargetCarbonic anhydrase 14
LigandBDBM50155552
Substrate/Competitorn/a
Meas. Tech.ChEMBL_544670 (CHEMBL1009247)
Ki 2.7±n/a nM
Citation Thiry, ARolin, SVullo, DFrankart, AScozzafava, ADogné, JMWouters, JSupuran, CTMasereel, B Indanesulfonamides as carbonic anhydrase inhibitors and anticonvulsant agents: structure-activity relationship and pharmacological evaluation. Eur J Med Chem43:2853-60 (2008) 
 
Carbonic anhydrase 14
Name:Carbonic anhydrase 14
Type:Enzyme
Mol. Mass.:37665.67
Organism:Homo sapiens (Human)
Description:Human (cloned) isozyme.
Residue:337
BDBM50155552
NameBDBM50155552
Synonyms:4-Chloro-N-(5-sulfamoyl-indan-2-yl)-benzamide CHEMBL364127
TypeSmall organic molecule
Emp. Form.C16H15ClN2O3S
Mol. Mass.350.82
SMILESNS(=O)(=O)c1ccc2CC(Cc2c1)NC(=O)c1ccc(Cl)cc1