Reaction Details
TargetCarbonic anhydrase 7
LigandBDBM10880
Substrate/Competitorn/a
Meas. Tech.ChEMBL_544671 (CHEMBL1009248)
Ki 2.5±n/a nM
Citation Thiry, ARolin, SVullo, DFrankart, AScozzafava, ADogné, JMWouters, JSupuran, CTMasereel, B Indanesulfonamides as carbonic anhydrase inhibitors and anticonvulsant agents: structure-activity relationship and pharmacological evaluation. Eur J Med Chem43:2853-60 (2008) 
 
Carbonic anhydrase 7
Name:Carbonic anhydrase 7
Type:Enzyme
Mol. Mass.:29664.11
Organism:Homo sapiens (Human)
Description:Human cloned isozyme.
Residue:264
BDBM10880
NameBDBM10880
Synonyms:AZA AZM acetazolamide Acetazolamide Acetazolamide (AZA) Acetazolamide, 5 Acetazolamide, AZA CHEMBL20 Sulfonamide, 1 US11278534, Example acetazolamide sulfonamide 1
TypeSmall organic molecule
Emp. Form.C4H6N4O3S2
Mol. Mass.222.245
SMILESCC(=O)Nc1nnc(s1)S(N)(=O)=O