Reaction Details
TargetCarbonic anhydrase 7
LigandBDBM50155556
Substrate/Competitorn/a
Meas. Tech.ChEMBL_544671 (CHEMBL1009248)
Ki 5.1±n/a nM
Citation Thiry, ARolin, SVullo, DFrankart, AScozzafava, ADogné, JMWouters, JSupuran, CTMasereel, B Indanesulfonamides as carbonic anhydrase inhibitors and anticonvulsant agents: structure-activity relationship and pharmacological evaluation. Eur J Med Chem43:2853-60 (2008) 
 
Carbonic anhydrase 7
Name:Carbonic anhydrase 7
Type:Enzyme
Mol. Mass.:29664.11
Organism:Homo sapiens (Human)
Description:Human cloned isozyme.
Residue:264
BDBM50155556
NameBDBM50155556
Synonyms:2,3-dihydro-1H-indene-5-sulfonamide Indan-5-sulfonic acid amide | indane-5-sulfonamide
TypeSmall organic molecule
Emp. Form.C9H11NO2S
Mol. Mass.197.254
SMILESNS(=O)(=O)c1ccc2CCCc2c1