Reaction Details
TargetCarbonic anhydrase 7
LigandBDBM50155553
Substrate/Competitorn/a
Meas. Tech.ChEMBL_544671 (CHEMBL1009248)
Ki 1.6±n/a nM
Citation Thiry, ARolin, SVullo, DFrankart, AScozzafava, ADogné, JMWouters, JSupuran, CTMasereel, B Indanesulfonamides as carbonic anhydrase inhibitors and anticonvulsant agents: structure-activity relationship and pharmacological evaluation. Eur J Med Chem43:2853-60 (2008) 
 
Carbonic anhydrase 7
Name:Carbonic anhydrase 7
Type:Enzyme
Mol. Mass.:29664.11
Organism:Homo sapiens (Human)
Description:Human cloned isozyme.
Residue:264
BDBM50155553
NameBDBM50155553
Synonyms:2-Amino-indan-5-sulfonic acid amide; hydrochloride CHEMBL559179
TypeSmall organic molecule
Emp. Form.C9H12N2O2S
Mol. Mass.212.269
SMILESNC1Cc2ccc(cc2C1)S(N)(=O)=O