Reaction Details
TargetCarbonic anhydrase 7
LigandBDBM50155555
Substrate/Competitorn/a
Meas. Tech.ChEMBL_544671 (CHEMBL1009248)
Ki 8±n/a nM
Citation Thiry, ARolin, SVullo, DFrankart, AScozzafava, ADogné, JMWouters, JSupuran, CTMasereel, B Indanesulfonamides as carbonic anhydrase inhibitors and anticonvulsant agents: structure-activity relationship and pharmacological evaluation. Eur J Med Chem43:2853-60 (2008) 
 
Carbonic anhydrase 7
Name:Carbonic anhydrase 7
Type:Enzyme
Mol. Mass.:29664.11
Organism:Homo sapiens (Human)
Description:Human cloned isozyme.
Residue:264
BDBM50155555
NameBDBM50155555
Synonyms:2-Amino-indan-5-sulfonic acid CHEMBL186263
TypeSmall organic molecule
Emp. Form.C9H11NO3S
Mol. Mass.213.254
SMILESNC1Cc2ccc(cc2C1)S(O)(=O)=O