Reaction Details
TargetCarbonic anhydrase 7
LigandBDBM11035
Substrate/Competitorn/a
Meas. Tech.ChEMBL_544671 (CHEMBL1009248)
Ki 6.8±n/a nM
Citation Thiry, ARolin, SVullo, DFrankart, AScozzafava, ADogné, JMWouters, JSupuran, CTMasereel, B Indanesulfonamides as carbonic anhydrase inhibitors and anticonvulsant agents: structure-activity relationship and pharmacological evaluation. Eur J Med Chem43:2853-60 (2008) 
 
Carbonic anhydrase 7
Name:Carbonic anhydrase 7
Type:Enzyme
Mol. Mass.:29664.11
Organism:Homo sapiens (Human)
Description:Human cloned isozyme.
Residue:264
BDBM11035
NameBDBM11035
Synonyms:2,3,4,5,6-pentafluoro-N-(5-sulfamoyl-2,3-dihydro-1H-inden-2-yl)benzamide CHEMBL184361 | Indanesulfonamide Derivative 12c
TypeSmall organic molecule
Emp. Form.C16H11F5N2O3S
Mol. Mass.406.327
SMILESNS(=O)(=O)c1ccc2CC(Cc2c1)NC(=O)c1c(F)c(F)c(F)c(F)c1F