Reaction Details
TargetCarbonic anhydrase 7
LigandBDBM50155554
Substrate/Competitorn/a
Meas. Tech.ChEMBL_544671 (CHEMBL1009248)
Ki 2.7±n/a nM
Citation Thiry, ARolin, SVullo, DFrankart, AScozzafava, ADogné, JMWouters, JSupuran, CTMasereel, B Indanesulfonamides as carbonic anhydrase inhibitors and anticonvulsant agents: structure-activity relationship and pharmacological evaluation. Eur J Med Chem43:2853-60 (2008) 
 
Carbonic anhydrase 7
Name:Carbonic anhydrase 7
Type:Enzyme
Mol. Mass.:29664.11
Organism:Homo sapiens (Human)
Description:Human cloned isozyme.
Residue:264
BDBM50155554
NameBDBM50155554
Synonyms:5-Chloro-2-methoxy-N-(5-sulfamoyl-indan-2-yl)-benzamide; hydrate CHEMBL500454
TypeSmall organic molecule
Emp. Form.C17H17ClN2O4S
Mol. Mass.380.846
SMILESCOc1ccc(Cl)cc1C(=O)NC1Cc2ccc(cc2C1)S(N)(=O)=O