Reaction Details
TargetHeat shock protein HSP 90-beta
LigandBDBM20800
Substrate/Competitorn/a
Meas. Tech.ChEMBL_543928 (CHEMBL1020363)
IC50 30±n/a nM
Citation Taldone, TSun, WChiosis, G Discovery and development of heat shock protein 90 inhibitors. Bioorg Med Chem17:2225-35 (2009) 
 
Heat shock protein HSP 90-beta
Name:Heat shock protein HSP 90-beta
Type:Molecular Chaperone
Mol. Mass.:83229.45
Organism:Homo sapiens (Human)
Description:P08238
Residue:724
BDBM20800
NameBDBM20800
Synonyms:2-amino-6-halopurine analogue, 20 CHEMBL467399 | hsp90_107
TypeSmall organic molecule
Emp. Form.C14H15ClN6O
Mol. Mass.318.762
SMILESCOc1c(C)cnc(Cn2cnc3c(Cl)nc(N)nc23)c1C