Reaction Details
TargetHeat shock protein HSP 90-beta
LigandBDBM50161650
Substrate/Competitorn/a
Meas. Tech.ChEMBL_543938 (CHEMBL1023067)
Kd 680±n/a nM
Citation Taldone, TSun, WChiosis, G Discovery and development of heat shock protein 90 inhibitors. Bioorg Med Chem17:2225-35 (2009) 
 
Heat shock protein HSP 90-beta
Name:Heat shock protein HSP 90-beta
Type:Molecular Chaperone
Mol. Mass.:83229.45
Organism:Homo sapiens (Human)
Description:P08238
Residue:724
BDBM50161650
NameBDBM50161650
Synonyms:4-(1,3-BENZODIOXOL-5-YL)-5-(5-ETHYL-2,4-DIHYDROXYPHENYL)-2H-PYRAZOLE-3-CARBOXYLIC ACID 4-Benzo[1,3]dioxol-5-yl-5-(5-ethyl-2,4-dihydroxy-phenyl)-2H-pyrazole-3-carboxylic acid | CHEMBL178130
TypeSmall organic molecule
Emp. Form.C19H16N2O6
Mol. Mass.368.3401
SMILESCCc1cc(-c2n[nH]c(C(O)=O)c2-c2ccc3OCOc3c2)c(O)cc1O