Reaction Details
TargetInsulin-like growth factor 1 receptor
LigandBDBM50378022
Substrate/Competitorn/a
Meas. Tech.ChEMBL_540380 (CHEMBL1025723)
IC50 546±n/a nM
Citation Chamberlain, SDRedman, AMPatnaik, SBrickhouse, KChew, YCDeanda, FGerding, RLei, HMoorthy, GPatrick, MStevens, KLWilson, JWBrad Shotwell, J Optimization of a series of 4,6-bis-anilino-1H-pyrrolo[2,3-d]pyrimidine inhibitors of IGF-1R: elimination of an acid-mediated decomposition pathway. Bioorg Med Chem Lett19:373-7 (2008) 
 
Insulin-like growth factor 1 receptor
Name:Insulin-like growth factor 1 receptor
Type:Protein
Mol. Mass.:154776.79
Organism:Homo sapiens (Human)
Description:P08069
Residue:1367
BDBM50378022
NameBDBM50378022
Synonyms:CHEMBL1964270
TypeSmall organic molecule
Emp. Form.C27H30N8O2
Mol. Mass.498.5795
SMILESCOc1cc(ccc1Nc1nc(-n2[nH]c(=O)c3ccccc23)c2cc[nH]c2n1)N1CCN(CC1)C(C)C