Reaction Details
TargetInsulin-like growth factor 1 receptor
LigandBDBM50265873
Substrate/Competitorn/a
Meas. Tech.ChEMBL_540380 (CHEMBL1025723)
IC50 16±n/a nM
Citation Chamberlain, SDRedman, AMPatnaik, SBrickhouse, KChew, YCDeanda, FGerding, RLei, HMoorthy, GPatrick, MStevens, KLWilson, JWBrad Shotwell, J Optimization of a series of 4,6-bis-anilino-1H-pyrrolo[2,3-d]pyrimidine inhibitors of IGF-1R: elimination of an acid-mediated decomposition pathway. Bioorg Med Chem Lett19:373-7 (2008) 
 
Insulin-like growth factor 1 receptor
Name:Insulin-like growth factor 1 receptor
Type:Protein
Mol. Mass.:154776.79
Organism:Homo sapiens (Human)
Description:P08069
Residue:1367
BDBM50265873
NameBDBM50265873
Synonyms:7-(2-(1-(2-(dimethylamino)acetyl)-5-methoxyindolin-6-ylamino)-7H-pyrrolo[2,3-d]pyrimidin-4-ylamino)isoindolin-1-one | CHEMBL517163
TypeSmall organic molecule
Emp. Form.C27H28N8O3
Mol. Mass.512.563
SMILESCOc1cc2CCN(C(=O)CN(C)C)c2cc1Nc1nc(Nc2cccc3CNC(=O)c23)c2cc[nH]c2n1