Reaction Details
TargetInsulin-like growth factor 1 receptor
LigandBDBM27783
Substrate/Competitorn/a
Meas. Tech.ChEMBL_540379 (CHEMBL1025722)
IC50 2±n/a nM
Citation Chamberlain, SDRedman, AMPatnaik, SBrickhouse, KChew, YCDeanda, FGerding, RLei, HMoorthy, GPatrick, MStevens, KLWilson, JWBrad Shotwell, J Optimization of a series of 4,6-bis-anilino-1H-pyrrolo[2,3-d]pyrimidine inhibitors of IGF-1R: elimination of an acid-mediated decomposition pathway. Bioorg Med Chem Lett19:373-7 (2008) 
 
Insulin-like growth factor 1 receptor
Name:Insulin-like growth factor 1 receptor
Type:Protein
Mol. Mass.:154776.79
Organism:Homo sapiens (Human)
Description:P08069
Residue:1367
BDBM27783
NameBDBM27783
Synonyms:2-fluoro-6-{[2-({2-methoxy-4-[4-(propan-2-yl)piperazin-1-yl]phenyl}amino)-7H-pyrrolo[2,3-d]pyrimidin-4-yl]amino}benzamide CHEMBL507625 | pyrrolo[2,3-d]pyrimidine deriv., 1
TypeSmall organic molecule
Emp. Form.C27H31FN8O2
Mol. Mass.518.5858
SMILESCOc1cc(ccc1Nc1nc(Nc2cccc(F)c2C(N)=O)c2cc[nH]c2n1)N1CCN(CC1)C(C)C