Reaction Details
TargetInsulin-like growth factor 1 receptor
LigandBDBM50266296
Substrate/Competitorn/a
Meas. Tech.ChEMBL_540379 (CHEMBL1025722)
IC50 32±n/a nM
Citation Chamberlain, SDRedman, AMPatnaik, SBrickhouse, KChew, YCDeanda, FGerding, RLei, HMoorthy, GPatrick, MStevens, KLWilson, JWBrad Shotwell, J Optimization of a series of 4,6-bis-anilino-1H-pyrrolo[2,3-d]pyrimidine inhibitors of IGF-1R: elimination of an acid-mediated decomposition pathway. Bioorg Med Chem Lett19:373-7 (2008) 
 
Insulin-like growth factor 1 receptor
Name:Insulin-like growth factor 1 receptor
Type:Protein
Mol. Mass.:154776.79
Organism:Homo sapiens (Human)
Description:P08069
Residue:1367
BDBM50266296
NameBDBM50266296
Synonyms:CHEMBL456269 | N2-(4-(4-isopropylpiperazin-1-yl)-2-methoxyphenyl)-N4-(2-methoxyphenyl)-7H-pyrrolo[2,3-d]pyrimidine-2,4-diamine
TypeSmall organic molecule
Emp. Form.C27H33N7O2
Mol. Mass.487.5966
SMILESCOc1ccccc1Nc1nc(Nc2ccc(cc2OC)N2CCN(CC2)C(C)C)nc2[nH]ccc12