Reaction Details
TargetInsulin-like growth factor 1 receptor
LigandBDBM50266333
Substrate/Competitorn/a
Meas. Tech.ChEMBL_540379 (CHEMBL1025722)
IC50 400±n/a nM
Citation Chamberlain, SDRedman, AMPatnaik, SBrickhouse, KChew, YCDeanda, FGerding, RLei, HMoorthy, GPatrick, MStevens, KLWilson, JWBrad Shotwell, J Optimization of a series of 4,6-bis-anilino-1H-pyrrolo[2,3-d]pyrimidine inhibitors of IGF-1R: elimination of an acid-mediated decomposition pathway. Bioorg Med Chem Lett19:373-7 (2008) 
 
Insulin-like growth factor 1 receptor
Name:Insulin-like growth factor 1 receptor
Type:Protein
Mol. Mass.:154776.79
Organism:Homo sapiens (Human)
Description:P08069
Residue:1367
BDBM50266333
NameBDBM50266333
Synonyms:CHEMBL458660 | N4-(indolin-7-yl)-N2-(4-(4-isopropylpiperazin-1-yl)-2-methoxyphenyl)-7H-pyrrolo[2,3-d]pyrimidine-2,4-diamine
TypeSmall organic molecule
Emp. Form.C28H34N8O
Mol. Mass.498.6226
SMILESCOc1cc(ccc1Nc1nc(Nc2cccc3CCNc23)c2cc[nH]c2n1)N1CCN(CC1)C(C)C