Reaction Details
TargetInsulin-like growth factor 1 receptor
LigandBDBM50378024
Substrate/Competitorn/a
Meas. Tech.ChEMBL_540379 (CHEMBL1025722)
IC50 5±n/a nM
Citation Chamberlain, SDRedman, AMPatnaik, SBrickhouse, KChew, YCDeanda, FGerding, RLei, HMoorthy, GPatrick, MStevens, KLWilson, JWBrad Shotwell, J Optimization of a series of 4,6-bis-anilino-1H-pyrrolo[2,3-d]pyrimidine inhibitors of IGF-1R: elimination of an acid-mediated decomposition pathway. Bioorg Med Chem Lett19:373-7 (2008) 
 
Insulin-like growth factor 1 receptor
Name:Insulin-like growth factor 1 receptor
Type:Protein
Mol. Mass.:154776.79
Organism:Homo sapiens (Human)
Description:P08069
Residue:1367
BDBM50378024
NameBDBM50378024
Synonyms:CHEMBL1964269
TypeSmall organic molecule
Emp. Form.C28H35N9O4S2
Mol. Mass.625.765
SMILESCOc1cc(ccc1Nc1nc(Nc2ccsc2C(N)=O)c2cc[nH]c2n1)N1CCC(CC1)N1CCN(CC1)S(C)(=O)=O