Reaction Details
TargetCannabinoid receptor 2
LigandBDBM50258606
Substrate/Competitorn/a
Meas. Tech.ChEMBL_523689 (CHEMBL998034)
Ki 7.8±n/a nM
Citation Manera, CSaccomanni, GAdinolfi, BBenetti, VLigresti, ACascio, MGTuccinardi, TLucchesi, VMartinelli, ANieri, PMasini, EDi Marzo, VFerrarini, PL Rational design, synthesis, and pharmacological properties of new 1,8-naphthyridin-2(1H)-on-3-carboxamide derivatives as highly selective cannabinoid-2 receptor agonists. J Med Chem52:3644-51 (2009) 
 
Cannabinoid receptor 2
Name:Cannabinoid receptor 2
Type:G Protein-Coupled Receptor (GPCR)
Mol. Mass.:39690.94
Organism:Homo sapiens (Human)
Description:P34972
Residue:360
BDBM50258606
NameBDBM50258606
Synonyms:CHEMBL467476 | N-(4-Methylcyclohexyl)-1-benzyl-1,8-naphthyridin-2(1H)-on-3-carboxamide
TypeSmall organic molecule
Emp. Form.C23H25N3O2
Mol. Mass.375.4635
SMILESCC1CCC(CC1)NC(=O)c1cc2cccnc2n(Cc2ccccc2)c1=O