Reaction Details
TargetHistamine H3 receptor
LigandBDBM50268291
Substrate/Competitorn/a
Meas. Tech.ChEMBL_523452 (CHEMBL1008304)
EC50 2±n/a nM
Citation Pierson, PDFettes, AFreichel, CGatti-McArthur, SHertel, CHuwyler, JMohr, PNakagawa, TNettekoven, MPlancher, JMRaab, SRichter, HRoche, ORodríguez Sarmiento, RMSchmitt, MSchuler, FTakahashi, TTaylor, SUllmer, CWiegand, R 5-hydroxyindole-2-carboxylic acid amides: novel histamine-3 receptor inverse agonists for the treatment of obesity. J Med Chem52:3855-68 (2009) 
 
Histamine H3 receptor
Name:Histamine H3 receptor
Type:G Protein-Coupled Receptor (GPCR)
Mol. Mass.:48691.47
Organism:Homo sapiens (Human)
Description:Binding assays were using CHO cells stably expressing hH3R receptors.
Residue:445
BDBM50268291
NameBDBM50268291
Synonyms:(1-(3,4-dichlorophenyl)-5-(1-isopropylpiperidin-4-yloxy)-1H-indol-2-yl)(4,4-difluoropiperidin-1-yl)methanone | CHEMBL523948
TypeSmall organic molecule
Emp. Form.C28H31Cl2F2N3O2
Mol. Mass.550.467
SMILESCC(C)N1CCC(CC1)Oc1ccc2n(c(cc2c1)C(=O)N1CCC(F)(F)CC1)-c1ccc(Cl)c(Cl)c1