Reaction Details
TargetHistamine H3 receptor
LigandBDBM50269053
Substrate/Competitorn/a
Meas. Tech.ChEMBL_523444 (CHEMBL1008296)
Ki 3±n/a nM
Citation Pierson, PDFettes, AFreichel, CGatti-McArthur, SHertel, CHuwyler, JMohr, PNakagawa, TNettekoven, MPlancher, JMRaab, SRichter, HRoche, ORodríguez Sarmiento, RMSchmitt, MSchuler, FTakahashi, TTaylor, SUllmer, CWiegand, R 5-hydroxyindole-2-carboxylic acid amides: novel histamine-3 receptor inverse agonists for the treatment of obesity. J Med Chem52:3855-68 (2009) 
 
Histamine H3 receptor
Name:Histamine H3 receptor
Type:G Protein-Coupled Receptor (GPCR)
Mol. Mass.:48691.47
Organism:Homo sapiens (Human)
Description:Binding assays were using CHO cells stably expressing hH3R receptors.
Residue:445
BDBM50269053
NameBDBM50269053
Synonyms:(5-(1-isopropylpiperidin-4-yloxy)-1-(2,2,2-trifluoroethyl)-1H-indol-2-yl)(morpholino)methanone | CHEMBL497030
TypeSmall organic molecule
Emp. Form.C23H30F3N3O3
Mol. Mass.453.4978
SMILESCC(C)N1CCC(CC1)Oc1ccc2n(CC(F)(F)F)c(cc2c1)C(=O)N1CCOCC1