Reaction Details
TargetHistamine H3 receptor
LigandBDBM50268950
Substrate/Competitorn/a
Meas. Tech.ChEMBL_523445 (CHEMBL1008297)
Ki 53±n/a nM
Citation Pierson, PDFettes, AFreichel, CGatti-McArthur, SHertel, CHuwyler, JMohr, PNakagawa, TNettekoven, MPlancher, JMRaab, SRichter, HRoche, ORodríguez Sarmiento, RMSchmitt, MSchuler, FTakahashi, TTaylor, SUllmer, CWiegand, R 5-hydroxyindole-2-carboxylic acid amides: novel histamine-3 receptor inverse agonists for the treatment of obesity. J Med Chem52:3855-68 (2009) 
 
Histamine H3 receptor
Name:Histamine H3 receptor
Type:G Protein-Coupled Receptor (GPCR)
Mol. Mass.:48607.98
Organism:Rattus norvegicus (rat)
Description:n/a
Residue:445
BDBM50268950
NameBDBM50268950
Synonyms:CHEMBL522715 | azepan-1-yl(5-(1-isopropylpiperidin-4-yloxy)-1H-indol-2-yl)methanone
TypeSmall organic molecule
Emp. Form.C23H33N3O2
Mol. Mass.383.527
SMILESCC(C)N1CCC(CC1)Oc1ccc2[nH]c(cc2c1)C(=O)N1CCCCCC1