Reaction Details
TargetHistamine H3 receptor
LigandBDBM50269099
Substrate/Competitorn/a
Meas. Tech.ChEMBL_523445 (CHEMBL1008297)
Ki 2±n/a nM
Citation Pierson, PDFettes, AFreichel, CGatti-McArthur, SHertel, CHuwyler, JMohr, PNakagawa, TNettekoven, MPlancher, JMRaab, SRichter, HRoche, ORodríguez Sarmiento, RMSchmitt, MSchuler, FTakahashi, TTaylor, SUllmer, CWiegand, R 5-hydroxyindole-2-carboxylic acid amides: novel histamine-3 receptor inverse agonists for the treatment of obesity. J Med Chem52:3855-68 (2009) 
 
Histamine H3 receptor
Name:Histamine H3 receptor
Type:G Protein-Coupled Receptor (GPCR)
Mol. Mass.:48607.98
Organism:Rattus norvegicus (rat)
Description:n/a
Residue:445
BDBM50269099
NameBDBM50269099
Synonyms:2-(2-(4,4-difluoropiperidine-1-carbonyl)-5-(1-isopropylpiperidin-4-yloxy)-1H-indol-1-yl)acetonitrile | CHEMBL521710
TypeSmall organic molecule
Emp. Form.C24H30F2N4O2
Mol. Mass.444.5174
SMILESCC(C)N1CCC(CC1)Oc1ccc2n(CC#N)c(cc2c1)C(=O)N1CCC(F)(F)CC1