Reaction Details
TargetHistamine H3 receptor
LigandBDBM50268292
Substrate/Competitorn/a
Meas. Tech.ChEMBL_523445 (CHEMBL1008297)
Ki 5±n/a nM
Citation Pierson, PDFettes, AFreichel, CGatti-McArthur, SHertel, CHuwyler, JMohr, PNakagawa, TNettekoven, MPlancher, JMRaab, SRichter, HRoche, ORodríguez Sarmiento, RMSchmitt, MSchuler, FTakahashi, TTaylor, SUllmer, CWiegand, R 5-hydroxyindole-2-carboxylic acid amides: novel histamine-3 receptor inverse agonists for the treatment of obesity. J Med Chem52:3855-68 (2009) 
 
Histamine H3 receptor
Name:Histamine H3 receptor
Type:G Protein-Coupled Receptor (GPCR)
Mol. Mass.:48607.98
Organism:Rattus norvegicus (rat)
Description:n/a
Residue:445
BDBM50268292
NameBDBM50268292
Synonyms:(1,1-Dioxo-1lambda*6*-thiomorpholin-4-yl)-[5-(1-isopropyl-piperidin-4-yloxy)-1-(2,2,2-trifluoro-ethyl)-1H-indol-2-yl]-methanone | CHEMBL489855
TypeSmall organic molecule
Emp. Form.C23H30F3N3O4S
Mol. Mass.501.562
SMILESCC(C)N1CCC(CC1)Oc1ccc2n(CC(F)(F)F)c(cc2c1)C(=O)N1CCS(=O)(=O)CC1