Reaction Details
TargetHistamine H3 receptor
LigandBDBM50268294
Substrate/Competitorn/a
Meas. Tech.ChEMBL_523445 (CHEMBL1008297)
Ki 13±n/a nM
Citation Pierson, PDFettes, AFreichel, CGatti-McArthur, SHertel, CHuwyler, JMohr, PNakagawa, TNettekoven, MPlancher, JMRaab, SRichter, HRoche, ORodríguez Sarmiento, RMSchmitt, MSchuler, FTakahashi, TTaylor, SUllmer, CWiegand, R 5-hydroxyindole-2-carboxylic acid amides: novel histamine-3 receptor inverse agonists for the treatment of obesity. J Med Chem52:3855-68 (2009) 
 
Histamine H3 receptor
Name:Histamine H3 receptor
Type:G Protein-Coupled Receptor (GPCR)
Mol. Mass.:48607.98
Organism:Rattus norvegicus (rat)
Description:n/a
Residue:445
BDBM50268294
NameBDBM50268294
Synonyms:CHEMBL520148 | morpholino(5-(1-(oxetan-3-yl)piperidin-4-yloxy)-1-(2,2,2-trifluoroethyl)-1H-indol-2-yl)methanone
TypeSmall organic molecule
Emp. Form.C23H28F3N3O4
Mol. Mass.467.4813
SMILESFC(F)(F)Cn1c(cc2cc(OC3CCN(CC3)C3COC3)ccc12)C(=O)N1CCOCC1