Reaction Details
TargetP2Y purinoceptor 12
LigandBDBM50268687
Substrate/Competitorn/a
Meas. Tech.ChEMBL_523462 (CHEMBL995340)
Ki 10000±n/a nM
Citation Baqi, YAtzler, KKöse, MGlänzel, MMüller, CE High-affinity, non-nucleotide-derived competitive antagonists of platelet P2Y12 receptors. J Med Chem52:3784-93 (2009) 
 
P2Y purinoceptor 12
Name:P2Y purinoceptor 12
Type:Enzyme
Mol. Mass.:39458.48
Organism:Homo sapiens (Human)
Description:Q9H244
Residue:342
BDBM50268687
NameBDBM50268687
Synonyms:CHEMBL522725 | sodium 1-amino-4-(2-hydroxyphenylamino)-9,10-dioxo-9,10-dihydroanthracene-2-sulfonate
TypeSmall organic molecule
Emp. Form.C20H13N2O6S
Mol. Mass.409.393
SMILESNc1c(cc(Nc2ccccc2O)c2C(=O)c3ccccc3C(=O)c12)S([O-])(=O)=O