Reaction Details
TargetP2Y purinoceptor 12
LigandBDBM50227018
Substrate/Competitorn/a
Meas. Tech.ChEMBL_523462 (CHEMBL995340)
Ki>10000±n/a nM
Citation Baqi, YAtzler, KKöse, MGlänzel, MMüller, CE High-affinity, non-nucleotide-derived competitive antagonists of platelet P2Y12 receptors. J Med Chem52:3784-93 (2009) 
 
P2Y purinoceptor 12
Name:P2Y purinoceptor 12
Type:Enzyme
Mol. Mass.:39458.48
Organism:Homo sapiens (Human)
Description:Q9H244
Residue:342
BDBM50227018
NameBDBM50227018
Synonyms:CHEMBL404659 | Sodium 1-amino-4-(3-nitrophenylamino)-9,10-dioxo-9,10-dihydroanthracene-2-sulfonate
TypeSmall organic molecule
Emp. Form.C20H12N3O7S
Mol. Mass.438.391
SMILESNc1c2C(=O)c3ccccc3C(=O)c2c(Nc2cccc(c2)[N+]([O-])=O)cc1S([O-])(=O)=O