Reaction Details
TargetP2Y purinoceptor 12
LigandBDBM50268766
Substrate/Competitorn/a
Meas. Tech.ChEMBL_523462 (CHEMBL995340)
Ki 19740±n/a nM
Citation Baqi, YAtzler, KKöse, MGlänzel, MMüller, CE High-affinity, non-nucleotide-derived competitive antagonists of platelet P2Y12 receptors. J Med Chem52:3784-93 (2009) 
 
P2Y purinoceptor 12
Name:P2Y purinoceptor 12
Type:Enzyme
Mol. Mass.:39458.48
Organism:Homo sapiens (Human)
Description:Q9H244
Residue:342
BDBM50268766
NameBDBM50268766
Synonyms:CHEMBL498229 | Disodium 1-amino-4-(4-amino-2-sulfophenylamino)-9,10-dioxo-9,10-dihydroanthracene-2-sulfonate
TypeSmall organic molecule
Emp. Form.C20H13N3O8S2
Mol. Mass.487.464
SMILESNc1ccc(Nc2cc(c(N)c3C(=O)c4ccccc4C(=O)c23)S([O-])(=O)=O)c(c1)S([O-])(=O)=O