Reaction Details
TargetP2Y purinoceptor 12
LigandBDBM50268877
Substrate/Competitorn/a
Meas. Tech.ChEMBL_523462 (CHEMBL995340)
Ki 24.9±n/a nM
Citation Baqi, YAtzler, KKöse, MGlänzel, MMüller, CE High-affinity, non-nucleotide-derived competitive antagonists of platelet P2Y12 receptors. J Med Chem52:3784-93 (2009) 
 
P2Y purinoceptor 12
Name:P2Y purinoceptor 12
Type:Enzyme
Mol. Mass.:39458.48
Organism:Homo sapiens (Human)
Description:Q9H244
Residue:342
BDBM50268877
NameBDBM50268877
Synonyms:CHEMBL455536 | Disodium 1-Amino-4-[4-phenylamino-3-sulfophenylamino]-9,10-dioxo-9,10-dihydroanthracene-2-sulfonate
TypeSmall organic molecule
Emp. Form.C26H17N3O8S2
Mol. Mass.563.56
SMILESNc1c2C(=O)c3ccccc3C(=O)c2c(Nc2ccc(Nc3ccccc3)c(c2)S([O-])(=O)=O)cc1S([O-])(=O)=O