Reaction Details
TargetDelta-type opioid receptor
LigandBDBM50268585
Substrate/Competitorn/a
Meas. Tech.ChEMBL_523524 (CHEMBL1000646)
Ki>1000±n/a nM
Citation Dolle, REMichaut, MMartinez-Teipel, BSeida, PRAjello, CWMuller, ALDeHaven, RNCarroll, PJ Nascent structure-activity relationship study of a diastereomeric series of kappa opioid receptor antagonists derived from CJ-15,208. Bioorg Med Chem Lett19:3647-50 (2009) 
 
Delta-type opioid receptor
Name:Delta-type opioid receptor
Type:G Protein-Coupled Receptor (GPCR)
Mol. Mass.:40382.98
Organism:Homo sapiens (Human)
Description:Competition binding assays were carried out using membrane preparations from transfected HN9.10 cells that constitutively expressed the delta opioid receptor.
Residue:372
BDBM50268585
NameBDBM50268585
Synonyms:Ac-L-Phe-D-trp-L-Phe-D-pro-NH2 | CHEMBL442612
TypeSmall organic molecule
Emp. Form.C36H40N6O5
Mol. Mass.636.74
SMILESCC(=O)N[C@@H](Cc1ccccc1)C(=O)N[C@H](Cc1c[nH]c2ccccc12)C(=O)N[C@@H](Cc1ccccc1)C(=O)N1CCC[C@@H]1C(N)=O