Reaction Details
TargetDelta-type opioid receptor
LigandBDBM50268528
Substrate/Competitorn/a
Meas. Tech.ChEMBL_523524 (CHEMBL1000646)
Ki>1000±n/a nM
Citation Dolle, REMichaut, MMartinez-Teipel, BSeida, PRAjello, CWMuller, ALDeHaven, RNCarroll, PJ Nascent structure-activity relationship study of a diastereomeric series of kappa opioid receptor antagonists derived from CJ-15,208. Bioorg Med Chem Lett19:3647-50 (2009) 
 
Delta-type opioid receptor
Name:Delta-type opioid receptor
Type:G Protein-Coupled Receptor (GPCR)
Mol. Mass.:40382.98
Organism:Homo sapiens (Human)
Description:Competition binding assays were carried out using membrane preparations from transfected HN9.10 cells that constitutively expressed the delta opioid receptor.
Residue:372
BDBM50268528
NameBDBM50268528
Synonyms:(3S,6R,9S,14aR)-6-((1H-indol-3-yl)methyl)-9-benzyl-3-(4-fluorobenzyl)decahydropyrrolo[1,2-a][1,4,7,10]tetraazacyclododecine-1,4,7,10-tetraone | CHEMBL501888
TypeSmall organic molecule
Emp. Form.C34H34FN5O4
Mol. Mass.595.6633
SMILESFc1ccc(C[C@@H]2NC(=O)[C@H]3CCCN3C(=O)[C@H](Cc3ccccc3)NC(=O)[C@@H](Cc3c[nH]c4ccccc34)NC2=O)cc1