Reaction Details
TargetKappa-type opioid receptor
LigandBDBM50268526
Substrate/Competitorn/a
Meas. Tech.ChEMBL_523522 (CHEMBL1000644)
Ki 14±n/a nM
Citation Dolle, REMichaut, MMartinez-Teipel, BSeida, PRAjello, CWMuller, ALDeHaven, RNCarroll, PJ Nascent structure-activity relationship study of a diastereomeric series of kappa opioid receptor antagonists derived from CJ-15,208. Bioorg Med Chem Lett19:3647-50 (2009) 
 
Kappa-type opioid receptor
Name:Kappa-type opioid receptor
Type:G Protein-Coupled Receptor (GPCR)
Mol. Mass.:42648.76
Organism:Homo sapiens (Human)
Description:P41145
Residue:380
BDBM50268526
NameBDBM50268526
Synonyms:CHEMBL506211 | c[L-Phe-D-pro-L-Tyr(OMe)-D-trp]
TypeSmall organic molecule
Emp. Form.C35H37N5O5
Mol. Mass.607.6988
SMILESCOc1ccc(C[C@@H]2NC(=O)[C@H]3CCCN3C(=O)[C@H](Cc3ccccc3)NC(=O)[C@@H](Cc3c[nH]c4ccccc34)NC2=O)cc1