Reaction Details
TargetMu-type opioid receptor
LigandBDBM50268464
Substrate/Competitorn/a
Meas. Tech.ChEMBL_523523 (CHEMBL1000645)
Ki 670±n/a nM
Citation Dolle, REMichaut, MMartinez-Teipel, BSeida, PRAjello, CWMuller, ALDeHaven, RNCarroll, PJ Nascent structure-activity relationship study of a diastereomeric series of kappa opioid receptor antagonists derived from CJ-15,208. Bioorg Med Chem Lett19:3647-50 (2009) 
 
Mu-type opioid receptor
Name:Mu-type opioid receptor
Type:G Protein-Coupled Receptor (GPCR)
Mol. Mass.:44789.51
Organism:Homo sapiens (Human)
Description:P35372
Residue:400
BDBM50268464
NameBDBM50268464
Synonyms:CHEMBL506217 | c[L-Tyr-D-pro-L-Phe-D-trp]
TypeSmall organic molecule
Emp. Form.C34H35N5O5
Mol. Mass.593.6722
SMILESOc1ccc(C[C@@H]2NC(=O)[C@@H](Cc3c[nH]c4ccccc34)NC(=O)[C@H](Cc3ccccc3)NC(=O)[C@H]3CCCN3C2=O)cc1