Reaction Details
TargetMu-type opioid receptor
LigandBDBM50268527
Substrate/Competitorn/a
Meas. Tech.ChEMBL_523523 (CHEMBL1000645)
Ki 210±n/a nM
Citation Dolle, REMichaut, MMartinez-Teipel, BSeida, PRAjello, CWMuller, ALDeHaven, RNCarroll, PJ Nascent structure-activity relationship study of a diastereomeric series of kappa opioid receptor antagonists derived from CJ-15,208. Bioorg Med Chem Lett19:3647-50 (2009) 
 
Mu-type opioid receptor
Name:Mu-type opioid receptor
Type:G Protein-Coupled Receptor (GPCR)
Mol. Mass.:44789.51
Organism:Homo sapiens (Human)
Description:P35372
Residue:400
BDBM50268527
NameBDBM50268527
Synonyms:(3S,6R,9S,14aR)-6-((1H-indol-3-yl)methyl)-3-benzyl-9-(4-fluorobenzyl)decahydropyrrolo[1,2-a][1,4,7,10]tetraazacyclododecine-1,4,7,10-tetraone | CHEMBL446754
TypeSmall organic molecule
Emp. Form.C34H34FN5O4
Mol. Mass.595.6633
SMILESFc1ccc(C[C@@H]2NC(=O)[C@@H](Cc3c[nH]c4ccccc34)NC(=O)[C@H](Cc3ccccc3)NC(=O)[C@H]3CCCN3C2=O)cc1