Reaction Details
TargetMelanocortin receptor 5
LigandBDBM50268798
Substrate/Competitorn/a
Meas. Tech.ChEMBL_523579 (CHEMBL997229)
EC50<0.1±n/a nM
CommentsZero 20220115
Citation Qu, HCai, MMayorov, AVGrieco, PZingsheim, MTrivedi, DHruby, VJ Substitution of arginine with proline and proline derivatives in melanocyte-stimulating hormones leads to selectivity for human melanocortin 4 receptor. J Med Chem52:3627-35 (2009) 
 
Melanocortin receptor 5
Name:Melanocortin receptor 5
Type:Enzyme
Mol. Mass.:36612.92
Organism:Homo sapiens (Human)
Description:P33032
Residue:325
BDBM50268798
NameBDBM50268798
Synonyms:Ac-Nle-c[Asp-His-DNaI(2')-Pro-Trp-Lys]-NH2 | CHEMBL194552
TypeSmall organic molecule
Emp. Form.C53H66N12O9
Mol. Mass.1015.1661
SMILESCCCC[C@H](NC(C)=O)C(=O)N[C@H]1CC(=O)NCCCC[C@H](NC(=O)[C@H](Cc2c[nH]c3ccccc23)NC(=O)[C@@H]2CCCN2C(=O)[C@@H](Cc2ccc3ccccc3c2)NC(=O)[C@H](Cc2cnc[nH]2)NC1=O)C(N)=O