Reaction Details
TargetAdenosine receptor A2b
LigandBDBM50268165
Substrate/Competitorn/a
Meas. Tech.ChEMBL_520192 (CHEMBL951835)
IC50 3.56±n/a nM
Citation Borrmann, THinz, SBertarelli, DCLi, WFlorin, NCScheiff, ABMüller, CE 1-alkyl-8-(piperazine-1-sulfonyl)phenylxanthines: development and characterization of adenosine A2B receptor antagonists and a new radioligand with subnanomolar affinity and subtype specificity. J Med Chem52:3994-4006 (2009) 
 
Adenosine receptor A2b
Name:Adenosine receptor A2b
Type:G Protein-Coupled Receptor (GPCR)
Mol. Mass.:36341.22
Organism:Homo sapiens (Human)
Description:n/a
Residue:332
BDBM50268165
NameBDBM50268165
Synonyms:1-Propyl-8-(4-(4-(3-trifluoromethylbenzyl)piperazine-1-sulfonyl)phenyl)-3,7-dihydropurine-2,6-dione | CHEMBL486688
TypeSmall organic molecule
Emp. Form.C26H27F3N6O4S
Mol. Mass.576.591
SMILESCCCn1c(=O)[nH]c2nc([nH]c2c1=O)-c1ccc(cc1)S(=O)(=O)N1CCN(Cc2cccc(c2)C(F)(F)F)CC1